Reaction Details
TargetDelta-type opioid receptor
LigandBDBM50143604
Substrate/Competitorn/a
Meas. Tech.ChEMBL_145190 (CHEMBL754435)
Ki 940±n/a nM
Citation Zhang, AXiong, WHilbert, JEDeVita, EKBidlack, JMNeumeyer, JL 2-aminothiazole-derived opioids. Bioisosteric replacement of phenols. J Med Chem47:1886-8 (2004) 
 
Delta-type opioid receptor
Name:Delta-type opioid receptor
Type:G Protein-Coupled Receptor (GPCR)
Mol. Mass.:40382.98
Organism:Homo sapiens (Human)
Description:Competition binding assays were carried out using membrane preparations from transfected HN9.10 cells that constitutively expressed the delta opioid receptor.
Residue:372
BDBM50143604
NameBDBM50143604
Synonyms:13-cyclopropylmethyl-1,16-dimethyl-(1R,12R,16R)-7-thia-5,13-diazatetracyclo[10.3.1.02,10.04,8]hexadeca-2(10),3,5,8-tetraen-6-amine | CHEMBL56356
TypeSmall organic molecule
Emp. Form.C19H25N3S
Mol. Mass.327.487
SMILESC[C@H]1[C@H]2Cc3cc4sc(N)nc4cc3[C@]1(C)CCN2CC1CC1