Reaction Details
TargetMu-type opioid receptor
LigandBDBM50143603
Substrate/Competitorn/a
Meas. Tech.ChEMBL_145574 (CHEMBL749650)
Ki 30±n/a nM
Citation Zhang, AXiong, WHilbert, JEDeVita, EKBidlack, JMNeumeyer, JL 2-aminothiazole-derived opioids. Bioisosteric replacement of phenols. J Med Chem47:1886-8 (2004) 
 
Mu-type opioid receptor
Name:Mu-type opioid receptor
Type:G Protein-Coupled Receptor (GPCR)
Mol. Mass.:44789.51
Organism:Homo sapiens (Human)
Description:P35372
Residue:400
BDBM50143603
NameBDBM50143603
Synonyms:11-amino-4-methyl-(1S,5R,16R,17S)-15-oxa-10-thia-4,12-diazahexacyclo[12.6.1.01,16.05,20.07,21.09,13]henicosa-7(21),8,11,13-tetraen-17-ol | CHEMBL294168
TypeSmall organic molecule
Emp. Form.C18H21N3O2S
Mol. Mass.343.443
SMILESCN1CC[C@@]23C4Oc5c2c(C[C@@H]1C3CC[C@@H]4O)cc1sc(N)nc51