Reaction Details
TargetKappa-type opioid receptor
LigandBDBM50143602
Substrate/Competitorn/a
Meas. Tech.ChEMBL_147223 (CHEMBL754911)
EC50 2.4±n/a nM
Citation Zhang, AXiong, WHilbert, JEDeVita, EKBidlack, JMNeumeyer, JL 2-aminothiazole-derived opioids. Bioisosteric replacement of phenols. J Med Chem47:1886-8 (2004) 
 
Kappa-type opioid receptor
Name:Kappa-type opioid receptor
Type:G Protein-Coupled Receptor (GPCR)
Mol. Mass.:42648.76
Organism:Homo sapiens (Human)
Description:P41145
Residue:380
BDBM50143602
NameBDBM50143602
Synonyms:20-cyclopropylmethyl-(1R,12R)-7-thia-5,20-diazapentacyclo[10.5.3.01,13.02,10.04,8]icosa-2(10),3,5,8-tetraen-6-amine | CHEMBL55671
TypeSmall organic molecule
Emp. Form.C21H27N3S
Mol. Mass.353.524
SMILESNc1nc2cc3c(C[C@@H]4C5CCCC[C@]35CCN4CC3CC3)cc2s1