Reaction Details
TargetEndothelin-1 receptor
LigandBDBM50143784
Substrate/Competitorn/a
Meas. Tech.ChEMBL_63370 (CHEMBL676106)
Ki 0.034±n/a nM
Citation Wu, CDecker, ERBlok, NBui, HYou, TJWang, JBourgoyne, ARKnowles, VBerens, KLHolland, GWBrock, TADixon, RA Discovery, modeling, and human pharmacokinetics of N-(2-acetyl-4,6-dimethylphenyl)-3-(3,4-dimethylisoxazol-5-ylsulfamoyl)thiophene-2-carboxamide (TBC3711), a second generation, ETA selective, and orally bioavailable endothelin antagonist. J Med Chem47:1969-86 (2004) 
 
Endothelin-1 receptor
Name:Endothelin-1 receptor
Type:Enzyme Catalytic Domain
Mol. Mass.:48256.91
Organism:RAT
Description:ENDOTHELIN A EDNRA RAT::P26684
Residue:426
BDBM50143784
NameBDBM50143784
Synonyms:(5S,6R,7R)-5-Benzo[1,3]dioxol-5-yl-2-butyl-7-[2-((S)-2-carboxy-propyl)-4-methoxy-phenyl]-6,7-dihydro-5H-[1]pyrindine-6-carboxylic acid J-104132
TypeSmall organic molecule
Emp. Form.C31H33NO7
Mol. Mass.531.5962
SMILESCCCCc1ccc2[C@@H]([C@H]([C@@H](c2n1)c1ccc(OC)cc1C[C@H](C)C(O)=O)C(O)=O)c1ccc2OCOc2c1