Reaction Details
TargetMelanocortin receptor 5
LigandBDBM50144873
Substrate/Competitorn/a
Meas. Tech.ChEMBL_106668 (CHEMBL884505)
EC50 0.16±n/a nM
Citation Wilczynski, AWang, XSJoseph, CGXiang, ZBauzo, RMScott, JWSorensen, NBShaw, AMMillard, WJRichards, NGHaskell-Luevano, C Identification of putative agouti-related protein(87-132)-melanocortin-4 receptor interactions by homology molecular modeling and validation using chimeric peptide ligands. J Med Chem47:2194-207 (2004) 
 
Melanocortin receptor 5
Name:Melanocortin receptor 5
Type:Enzyme
Mol. Mass.:36966.58
Organism:Mus musculus (Mouse)
Description:P41149
Residue:325
BDBM50144873
NameBDBM50144873
Synonyms:Ac-Nle-c[Asp-His-DPhe-Arg-Trp-Gly-Lys]-NH2 | CHEMBL216295
TypeSmall organic molecule
Emp. Form.C50H69N15O10
Mol. Mass.1040.1774
SMILESCC(C)C[C@H](NC(C)=O)C(=O)N[C@H]1CC(=O)ONCCCC[C@@H](NC(=O)[C@@H](Cc2c[nH]c3ccccc23)NC(=O)[C@H](CCCNC(N)=N)NC(=O)[C@H](Cc2ccccc2)NC(=O)[C@H](Cc2cnc[nH]2)NC1=O)C(N)=O