Reaction Details
TargetRNA-directed RNA polymerase
LigandBDBM50144934
Substrate/Competitorn/a
Meas. Tech.ChEMBL_84043 (CHEMBL691889)
IC50 4000±n/a nM
Citation Eldrup, ABAllerson, CRBennett, CFBera, SBhat, BBhat, NBosserman, MRBrooks, JBurlein, CCarroll, SSCook, PDGetty, KLMacCoss, MMcMasters, DROlsen, DBPrakash, TPPrhavc, MSong, QTomassini, JEXia, J Structure-activity relationship of purine ribonucleosides for inhibition of hepatitis C virus RNA-dependent RNA polymerase. J Med Chem47:2283-95 (2004) 
 
RNA-directed RNA polymerase
Name:RNA-directed RNA polymerase
Type:Protein
Mol. Mass.:25173.95
Organism:Hepatitis C virus
Description:Q8JXU8
Residue:229
BDBM50144934
NameBDBM50144934
Synonyms:(2R,3R,4R,5R)-2-(6-hydroxy-9H-purin-9-yl)-5-(hydroxymethyl)-3-methyloxolane-3,4-diol | CHEMBL76105
TypeSmall organic molecule
Emp. Form.C11H14N4O5
Mol. Mass.282.2527
SMILESC[C@@]1(O)[C@H](O)[C@@H](CO)O[C@H]1n1cnc2c1nc[nH]c2=O