Reaction Details
TargetRNA-directed RNA polymerase
LigandBDBM50144938
Substrate/Competitorn/a
Meas. Tech.ChEMBL_84043 (CHEMBL691889)
IC50 1800±n/a nM
Citation Eldrup, ABAllerson, CRBennett, CFBera, SBhat, BBhat, NBosserman, MRBrooks, JBurlein, CCarroll, SSCook, PDGetty, KLMacCoss, MMcMasters, DROlsen, DBPrakash, TPPrhavc, MSong, QTomassini, JEXia, J Structure-activity relationship of purine ribonucleosides for inhibition of hepatitis C virus RNA-dependent RNA polymerase. J Med Chem47:2283-95 (2004) 
 
RNA-directed RNA polymerase
Name:RNA-directed RNA polymerase
Type:Protein
Mol. Mass.:25173.95
Organism:Hepatitis C virus
Description:Q8JXU8
Residue:229
BDBM50144938
NameBDBM50144938
Synonyms:2-Amino-9-((2R,3S,4S,5R)-4-fluoro-3-hydroxy-5-hydroxymethyl-tetrahydro-furan-2-yl)-1,9-dihydro-purin-6-one | CHEMBL420751
TypeSmall organic molecule
Emp. Form.C10H12FN5O4
Mol. Mass.285.2318
SMILESNc1nc2n(cnc2c(=O)[nH]1)[C@@H]1O[C@H](CO)[C@@H](F)[C@H]1O