Reaction Details
TargetRNA-directed RNA polymerase
LigandBDBM50144933
Substrate/Competitorn/a
Meas. Tech.ChEMBL_84043 (CHEMBL691889)
IC50 28000±n/a nM
Citation Eldrup, ABAllerson, CRBennett, CFBera, SBhat, BBhat, NBosserman, MRBrooks, JBurlein, CCarroll, SSCook, PDGetty, KLMacCoss, MMcMasters, DROlsen, DBPrakash, TPPrhavc, MSong, QTomassini, JEXia, J Structure-activity relationship of purine ribonucleosides for inhibition of hepatitis C virus RNA-dependent RNA polymerase. J Med Chem47:2283-95 (2004) 
 
RNA-directed RNA polymerase
Name:RNA-directed RNA polymerase
Type:Protein
Mol. Mass.:25173.95
Organism:Hepatitis C virus
Description:Q8JXU8
Residue:229
BDBM50144933
NameBDBM50144933
Synonyms:(2R,3S,4S,5R)-4-Fluoro-5-hydroxymethyl-2-(6-methylamino-purin-9-yl)-tetrahydro-furan-3-ol | CHEMBL72928
TypeSmall organic molecule
Emp. Form.C10H12FN5O3
Mol. Mass.269.2324
SMILESNc1ncnc2n(cnc12)[C@@H]1O[C@H](CO)[C@@H](F)[C@H]1O