Reaction Details
TargetD(4) dopamine receptor
LigandBDBM50145075
Substrate/Competitorn/a
Meas. Tech.ChEMBL_60675 (CHEMBL674046)
Ki 167±n/a nM
Citation Stewart, AOCowart, MDMoreland, RBLatshaw, SPMatulenko, MABhatia, PAWang, XDaanen, JFNelson, SLTerranova, MANamovic, MTDonnelly-Roberts, DLMiller, LNNakane, MSullivan, JPBrioni, JD Dopamine D4 ligands and models of receptor activation: 2-(4-pyridin-2-ylpiperazin-1-ylmethyl)-1H-benzimidazole and related heteroarylmethylarylpiperazines exhibit a substituent effect responsible for additional efficacy tuning. J Med Chem47:2348-55 (2004) 
 
D(4) dopamine receptor
Name:D(4) dopamine receptor
Type:Enzyme
Mol. Mass.:48373.19
Organism:Homo sapiens (Human)
Description:P21917
Residue:419
BDBM50145075
NameBDBM50145075
Synonyms:2-((4-(pyridin-2-yl)piperazin-1-yl)methyl)-1H-benzo[d]imidazole ABT-724 | CHEMBL440687
TypeSmall organic molecule
Emp. Form.C17H19N5
Mol. Mass.293.3663
SMILESC(N1CCN(CC1)c1ccccn1)c1nc2ccccc2[nH]1