Reaction Details
TargetD(2) dopamine receptor
LigandBDBM50102712
Substrate/Competitorn/a
Meas. Tech.ChEMBL_60078 (CHEMBL672347)
Ki 1310±n/a nM
Citation Stewart, AOCowart, MDMoreland, RBLatshaw, SPMatulenko, MABhatia, PAWang, XDaanen, JFNelson, SLTerranova, MANamovic, MTDonnelly-Roberts, DLMiller, LNNakane, MSullivan, JPBrioni, JD Dopamine D4 ligands and models of receptor activation: 2-(4-pyridin-2-ylpiperazin-1-ylmethyl)-1H-benzimidazole and related heteroarylmethylarylpiperazines exhibit a substituent effect responsible for additional efficacy tuning. J Med Chem47:2348-55 (2004) 
 
D(2) dopamine receptor
Name:D(2) dopamine receptor
Type:Cell-surface receptors
Mol. Mass.:50647.10
Organism:Homo sapiens (Human)
Description:P14416
Residue:443
BDBM50102712
NameBDBM50102712
Synonyms:2-((4-(4-chlorophenyl)piperazin-1-yl)methyl)-pyrazolo[1,5-a]pyridine 2-[4-(4-Chloro-phenyl)-piperazin-1-ylmethyl]-pyrazolo[1,5-a]pyridine CHEMBL310843
TypeSmall organic molecule
Emp. Form.C18H19ClN4
Mol. Mass.326.823
SMILESClc1ccc(cc1)N1CCN(Cc2cc3ccccn3n2)CC1