Reaction Details
TargetD(2) dopamine receptor
LigandBDBM50145084
Substrate/Competitorn/a
Meas. Tech.ChEMBL_60078 (CHEMBL672347)
Ki>10000±n/a nM
Citation Stewart, AOCowart, MDMoreland, RBLatshaw, SPMatulenko, MABhatia, PAWang, XDaanen, JFNelson, SLTerranova, MANamovic, MTDonnelly-Roberts, DLMiller, LNNakane, MSullivan, JPBrioni, JD Dopamine D4 ligands and models of receptor activation: 2-(4-pyridin-2-ylpiperazin-1-ylmethyl)-1H-benzimidazole and related heteroarylmethylarylpiperazines exhibit a substituent effect responsible for additional efficacy tuning. J Med Chem47:2348-55 (2004) 
 
D(2) dopamine receptor
Name:D(2) dopamine receptor
Type:Cell-surface receptors
Mol. Mass.:50647.10
Organism:Homo sapiens (Human)
Description:P14416
Residue:443
BDBM50145084
NameBDBM50145084
Synonyms:2-[4-(4-Chloro-phenyl)-piperazin-1-ylmethyl]-1H-benzoimidazole | CHEMBL76982
TypeSmall organic molecule
Emp. Form.C18H19ClN4
Mol. Mass.326.823
SMILESClc1ccc(cc1)N1CCN(Cc2nc3ccccc3[nH]2)CC1