Reaction Details
TargetD(4) dopamine receptor
LigandBDBM50145083
Substrate/Competitorn/a
Meas. Tech.ChEMBL_60675 (CHEMBL674046)
Ki 26.5±n/a nM
Citation Stewart, AOCowart, MDMoreland, RBLatshaw, SPMatulenko, MABhatia, PAWang, XDaanen, JFNelson, SLTerranova, MANamovic, MTDonnelly-Roberts, DLMiller, LNNakane, MSullivan, JPBrioni, JD Dopamine D4 ligands and models of receptor activation: 2-(4-pyridin-2-ylpiperazin-1-ylmethyl)-1H-benzimidazole and related heteroarylmethylarylpiperazines exhibit a substituent effect responsible for additional efficacy tuning. J Med Chem47:2348-55 (2004) 
 
D(4) dopamine receptor
Name:D(4) dopamine receptor
Type:Enzyme
Mol. Mass.:48373.19
Organism:Homo sapiens (Human)
Description:P21917
Residue:419
BDBM50145083
NameBDBM50145083
Synonyms:2-[4-(3-Methoxy-phenyl)-piperazin-1-ylmethyl]-1H-benzoimidazole | CHEMBL306711
TypeSmall organic molecule
Emp. Form.C19H22N4O
Mol. Mass.322.4042
SMILESCOc1cccc(c1)N1CCN(Cc2nc3ccccc3[nH]2)CC1