Reaction Details
TargetThymidine kinase, cytosolic
LigandBDBM50135089
Substrate/Competitorn/a
Meas. Tech.ChEMBL_208002 (CHEMBL816084)
Ki 220±n/a nM
Citation Russ, PSchelling, PScapozza, LFolkers, GClercq, EDMarquez, VE Synthesis and biological evaluation of 5-substituted derivatives of the potent antiherpes agent (north)-methanocarbathymine. J Med Chem46:5045-54 (2003) 
 
Thymidine kinase, cytosolic
Name:Thymidine kinase, cytosolic
Type:PROTEIN
Mol. Mass.:25476.50
Organism:Homo sapiens (Human)
Description:ChEMBL_1333884
Residue:234
BDBM50135089
NameBDBM50135089
Synonyms:C-BVdU | CHEMBL341644
TypeSmall organic molecule
Emp. Form.C12H15BrN2O4
Mol. Mass.331.162
SMILESOC[C@@H]1C[C@@H](C[C@H]1O)n1cc(C=CBr)c(=O)[nH]c1=O