Reaction Details
TargetThymidine kinase, cytosolic
LigandBDBM50370388
Substrate/Competitorn/a
Meas. Tech.ChEMBL_208002 (CHEMBL816084)
Ki 90±n/a nM
Citation Russ, PSchelling, PScapozza, LFolkers, GClercq, EDMarquez, VE Synthesis and biological evaluation of 5-substituted derivatives of the potent antiherpes agent (north)-methanocarbathymine. J Med Chem46:5045-54 (2003) 
 
Thymidine kinase, cytosolic
Name:Thymidine kinase, cytosolic
Type:PROTEIN
Mol. Mass.:25476.50
Organism:Homo sapiens (Human)
Description:ChEMBL_1333884
Residue:234
BDBM50370388
NameBDBM50370388
Synonyms:5IUDR Allergan-211 Herplex IDU
TypeSmall organic molecule
Emp. Form.C9H11IN2O5
Mol. Mass.354.0985
SMILESOC[C@H]1O[C@H](C[C@@H]1O)n1cc(I)c(=O)[nH]c1=O