Reaction Details
TargetThymidine kinase, cytosolic
LigandBDBM50422566
Substrate/Competitorn/a
Meas. Tech.ChEMBL_208002 (CHEMBL816084)
Ki 210±n/a nM
Citation Russ, PSchelling, PScapozza, LFolkers, GClercq, EDMarquez, VE Synthesis and biological evaluation of 5-substituted derivatives of the potent antiherpes agent (north)-methanocarbathymine. J Med Chem46:5045-54 (2003) 
 
Thymidine kinase, cytosolic
Name:Thymidine kinase, cytosolic
Type:PROTEIN
Mol. Mass.:25476.50
Organism:Homo sapiens (Human)
Description:ChEMBL_1333884
Residue:234
BDBM50422566
NameBDBM50422566
Synonyms:CHEMBL2311131
TypeSmall organic molecule
Emp. Form.C10H13IN2O4
Mol. Mass.352.1257
SMILESOC[C@H]1C[C@H](C[C@@H]1O)n1cc(I)c(=O)[nH]c1=O