Reaction Details
TargetProthrombin
LigandBDBM50147804
Substrate/Competitorn/a
Meas. Tech.ChEMBL_208532 (CHEMBL813626)
Ki 1.8±n/a nM
Citation Young, MBBarrow, JCGlass, KLLundell, GFNewton, CLPellicore, JMRittle, KESelnick, HGStauffer, KJVacca, JPWilliams, PDBohn, DClayton, FCCook, JJKrueger, JAKuo, LCLewis, SDLucas, BJMcMasters, DRMiller-Stein, CPietrak, BLWallace, AAWhite, RBWong, BYan, YNantermet, PG Discovery and evaluation of potent P1 aryl heterocycle-based thrombin inhibitors. J Med Chem47:2995-3008 (2004) 
 
Prothrombin
Name:Prothrombin
Type:Protein
Mol. Mass.:70029.57
Organism:Homo sapiens (Human)
Description:P00734
Residue:622
BDBM50147804
NameBDBM50147804
Synonyms:2-[(S)-1-((R)-2-Amino-3-phenyl-propionyl)-pyrrolidin-2-yl]-N-(5-chloro-2-[1,2,4]triazol-1-yl-benzyl)-acetamide | CHEMBL320664
TypeSmall organic molecule
Emp. Form.C24H27ClN6O2
Mol. Mass.466.963
SMILESN[C@H](Cc1ccccc1)C(=O)N1CCC[C@H]1CC(=O)NCc1cc(Cl)ccc1-n1cncn1