Reaction Details
TargetProthrombin
LigandBDBM50147808
Substrate/Competitorn/a
Meas. Tech.ChEMBL_208532 (CHEMBL813626)
Ki 16±n/a nM
Citation Young, MBBarrow, JCGlass, KLLundell, GFNewton, CLPellicore, JMRittle, KESelnick, HGStauffer, KJVacca, JPWilliams, PDBohn, DClayton, FCCook, JJKrueger, JAKuo, LCLewis, SDLucas, BJMcMasters, DRMiller-Stein, CPietrak, BLWallace, AAWhite, RBWong, BYan, YNantermet, PG Discovery and evaluation of potent P1 aryl heterocycle-based thrombin inhibitors. J Med Chem47:2995-3008 (2004) 
 
Prothrombin
Name:Prothrombin
Type:Protein
Mol. Mass.:70029.57
Organism:Homo sapiens (Human)
Description:P00734
Residue:622
BDBM50147808
NameBDBM50147808
Synonyms:2-[3-(2,2-Difluoro-2-pyridin-2-yl-ethylamino)-2-oxo-2H-pyrazin-1-yl]-N-(2-[1,2,4]triazol-1-yl-benzyl)-acetamide | CHEMBL101588
TypeSmall organic molecule
Emp. Form.C22H20F2N8O2
Mol. Mass.466.4434
SMILESFC(F)(CNc1nccn(CC(=O)NCc2ccccc2-n2cncn2)c1=O)c1ccccn1