Reaction Details
TargetProthrombin
LigandBDBM50147823
Substrate/Competitorn/a
Meas. Tech.ChEMBL_208532 (CHEMBL813626)
Ki 6.9±n/a nM
Citation Young, MBBarrow, JCGlass, KLLundell, GFNewton, CLPellicore, JMRittle, KESelnick, HGStauffer, KJVacca, JPWilliams, PDBohn, DClayton, FCCook, JJKrueger, JAKuo, LCLewis, SDLucas, BJMcMasters, DRMiller-Stein, CPietrak, BLWallace, AAWhite, RBWong, BYan, YNantermet, PG Discovery and evaluation of potent P1 aryl heterocycle-based thrombin inhibitors. J Med Chem47:2995-3008 (2004) 
 
Prothrombin
Name:Prothrombin
Type:Protein
Mol. Mass.:70029.57
Organism:Homo sapiens (Human)
Description:P00734
Residue:622
BDBM50147823
NameBDBM50147823
Synonyms:2-[6-Chloro-3-(2,2-difluoro-2-pyridin-2-yl-ethylamino)-2-oxo-2H-pyrazin-1-yl]-N-(2-pyrazol-1-yl-benzyl)-acetamide | CHEMBL321141
TypeSmall organic molecule
Emp. Form.C23H20ClF2N7O2
Mol. Mass.499.9
SMILESFC(F)(CNc1ncc(Cl)n(CC(=O)NCc2ccccc2-n2cccn2)c1=O)c1ccccn1