Reaction Details
TargetInterstitial collagenase
LigandBDBM50146629
Substrate/Competitorn/a
Meas. Tech.ChEMBL_106147 (CHEMBL718694)
Ki 3±n/a nM
Citation Källblad, PTodorov, NPWillems, HMAlberts, IL Receptor flexibility in the in silico screening of reagents in the S1' pocket of human collagenase. J Med Chem47:2761-7 (2004) 
 
Interstitial collagenase
Name:Interstitial collagenase
Type:Enzyme
Mol. Mass.:54010.26
Organism:Homo sapiens (Human)
Description: P03956
Residue:469
BDBM50146629
NameBDBM50146629
Synonyms:CHEMBL330040 | N-Hydroxy-2-[(4-nitro-benzyl)-(4-trifluoromethyl-benzenesulfonyl)-amino]-acetamide
TypeSmall organic molecule
Emp. Form.C16H14F3N3O6S
Mol. Mass.433.359
SMILESONC(=O)CN(Cc1ccc(cc1)[N+]([O-])=O)S(=O)(=O)c1ccc(cc1)C(F)(F)F