Reaction Details
TargetInterstitial collagenase
LigandBDBM50082556
Substrate/Competitorn/a
Meas. Tech.ChEMBL_106147 (CHEMBL718694)
Ki 8.20±n/a nM
Citation Källblad, PTodorov, NPWillems, HMAlberts, IL Receptor flexibility in the in silico screening of reagents in the S1' pocket of human collagenase. J Med Chem47:2761-7 (2004) 
 
Interstitial collagenase
Name:Interstitial collagenase
Type:Enzyme
Mol. Mass.:54010.26
Organism:Homo sapiens (Human)
Description: P03956
Residue:469
BDBM50082556
NameBDBM50082556
Synonyms:(S)-2,2-Dimethyl-4-[4-(pyridin-4-yloxy)-benzenesulfonyl]-thiomorpholine-3-carboxylic acid hydroxyamide 2,2-Dimethyl-4-[4-(pyridin-4-yloxy)-benzenesulfonyl]-thiomorpholine-3-carboxylic acid hydroxyamide 2,2-Dimethyl-4-[4-(pyridin-4-yloxy)-benzenesulfonyl]-thiomorpholine-3-carboxylic acid hydroxyamide(prinomastat) CHEMBL75094 | Prinomastat
TypeSmall organic molecule
Emp. Form.C18H21N3O5S2
Mol. Mass.423.506
SMILESCC1(C)SCCN([C@H]1C(=O)NO)S(=O)(=O)c1ccc(Oc2ccncc2)cc1