Reaction Details
TargetInterstitial collagenase
LigandBDBM50146634
Substrate/Competitorn/a
Meas. Tech.ChEMBL_105980 (CHEMBL713993)
IC50 1.3±n/a nM
Citation Källblad, PTodorov, NPWillems, HMAlberts, IL Receptor flexibility in the in silico screening of reagents in the S1' pocket of human collagenase. J Med Chem47:2761-7 (2004) 
 
Interstitial collagenase
Name:Interstitial collagenase
Type:Enzyme
Mol. Mass.:54010.26
Organism:Homo sapiens (Human)
Description: P03956
Residue:469
BDBM50146634
NameBDBM50146634
Synonyms:CHEMBL328903 | N*1*-(2,2-Dimethyl-1-methylcarbamoyl-propyl)-N*4*-hydroxy-2-isobutyl-3-(6-oxo-6H-quinolizine-4-sulfonylamino)-succinamide
TypeSmall organic molecule
Emp. Form.C24H35N5O7S
Mol. Mass.537.629
SMILESCNC(=O)C(NC(=O)C(CC(C)C)C(NS(=O)(=O)c1cccc2cccc(=O)n12)C(=O)NO)C(C)(C)C