Reaction Details
TargetNitric oxide synthase, brain
LigandBDBM50150885
Substrate/Competitorn/a
Meas. Tech.ChEMBL_305342 (CHEMBL833562)
IC50 54±n/a nM
Citation Nason, DMHeck, SDBodenstein, MSLowe, JANelson, RBListon, DRNolan, CELanyon, LFWard, KMVolkmann, RA Substituted 6-phenyl-pyridin-2-ylamines: selective and potent inhibitors of neuronal nitric oxide synthase. Bioorg Med Chem Lett14:4511-4 (2004) 
 
Nitric oxide synthase, brain
Name:Nitric oxide synthase, brain
Type:Homodimer
Mol. Mass.:160985.98
Organism:Homo sapiens (Human)
Description:P29475
Residue:1434
BDBM50150885
NameBDBM50150885
Synonyms:6-(4-Dimethylaminomethyl-5-ethyl-2-methoxy-phenyl)-pyridin-2-ylamine | CHEMBL364188
TypeSmall organic molecule
Emp. Form.C17H23N3O
Mol. Mass.285.384
SMILESCCc1cc(c(OC)cc1CN(C)C)-c1cccc(N)n1