Reaction Details
TargetNitric oxide synthase, brain
LigandBDBM50150887
Substrate/Competitorn/a
Meas. Tech.ChEMBL_305342 (CHEMBL833562)
IC50 58±n/a nM
Citation Nason, DMHeck, SDBodenstein, MSLowe, JANelson, RBListon, DRNolan, CELanyon, LFWard, KMVolkmann, RA Substituted 6-phenyl-pyridin-2-ylamines: selective and potent inhibitors of neuronal nitric oxide synthase. Bioorg Med Chem Lett14:4511-4 (2004) 
 
Nitric oxide synthase, brain
Name:Nitric oxide synthase, brain
Type:Homodimer
Mol. Mass.:160985.98
Organism:Homo sapiens (Human)
Description:P29475
Residue:1434
BDBM50150887
NameBDBM50150887
Synonyms:6-[4-(2-Dimethylamino-ethoxy)-5-ethyl-2-methoxy-phenyl]-pyridin-2-ylamine | CHEMBL183892
TypeSmall organic molecule
Emp. Form.C18H25N3O2
Mol. Mass.315.41
SMILESCCc1cc(c(OC)cc1OCCN(C)C)-c1cccc(N)n1