Reaction Details
TargetProstaglandin F2-alpha receptor
LigandBDBM50150895
Substrate/Competitorn/a
Meas. Tech.ChEMBL_302844 (CHEMBL827889)
Ki>10000±n/a nM
Citation Selliah, RDHellberg, MRSharif, NAMcLaughlin, MAWilliams, GWScott, DAEarnest, DHaggard, KSDean, WDDelgado, PGaines, MSConrow, REKlimko, PG AL-12182, a novel 11-oxa prostaglandin analog with topical ocular hypotensive activity in the monkey. Bioorg Med Chem Lett14:4525-8 (2004) 
 
Prostaglandin F2-alpha receptor
Name:Prostaglandin F2-alpha receptor
Type:Enzyme Catalytic Domain
Mol. Mass.:41044.75
Organism:BOVINE
Description:ProstaglandinF2Alpha PTGFR BOVINE::P37289
Residue:362
BDBM50150895
NameBDBM50150895
Synonyms:(Z)-7-[(2R,3S,4R)-4-Hydroxy-2-((E)-(R)-3-hydroxy-oct-1-enyl)-tetrahydro-furan-3-yl]-hept-5-enoic acid | CHEMBL264554
TypeSmall organic molecule
Emp. Form.C19H32O5
Mol. Mass.340.4544
SMILESCCCCC[C@@H](O)\C=C\[C@H]1OC[C@H](O)[C@@H]1C\C=C/CCCC(O)=O