Reaction Details
TargetProstaglandin F2-alpha receptor
LigandBDBM50150896
Substrate/Competitorn/a
Meas. Tech.ChEMBL_302844 (CHEMBL827889)
Ki 820±n/a nM
Citation Selliah, RDHellberg, MRSharif, NAMcLaughlin, MAWilliams, GWScott, DAEarnest, DHaggard, KSDean, WDDelgado, PGaines, MSConrow, REKlimko, PG AL-12182, a novel 11-oxa prostaglandin analog with topical ocular hypotensive activity in the monkey. Bioorg Med Chem Lett14:4525-8 (2004) 
 
Prostaglandin F2-alpha receptor
Name:Prostaglandin F2-alpha receptor
Type:Enzyme Catalytic Domain
Mol. Mass.:41044.75
Organism:BOVINE
Description:ProstaglandinF2Alpha PTGFR BOVINE::P37289
Residue:362
BDBM50150896
NameBDBM50150896
Synonyms:(Z)-8-{(2R,3S,4R)-2-[(E)-(S)-4-(3-Chloro-phenoxy)-3-hydroxy-but-1-enyl]-4-hydroxy-tetrahydro-furan-3-yl}-oct-4-enoic acid | CHEMBL433752
TypeSmall organic molecule
Emp. Form.C22H29ClO6
Mol. Mass.424.915
SMILESO[C@H](COc1cccc(Cl)c1)\C=C\[C@H]1OC[C@H](O)[C@@H]1CCC\C=C/CCC(O)=O