Reaction Details
TargetProstaglandin F2-alpha receptor
LigandBDBM50150903
Substrate/Competitorn/a
Meas. Tech.ChEMBL_310565 (CHEMBL834139)
EC50 2380±n/a nM
Citation Selliah, RDHellberg, MRSharif, NAMcLaughlin, MAWilliams, GWScott, DAEarnest, DHaggard, KSDean, WDDelgado, PGaines, MSConrow, REKlimko, PG AL-12182, a novel 11-oxa prostaglandin analog with topical ocular hypotensive activity in the monkey. Bioorg Med Chem Lett14:4525-8 (2004) 
 
Prostaglandin F2-alpha receptor
Name:Prostaglandin F2-alpha receptor
Type:Enzyme
Mol. Mass.:40072.29
Organism:Homo sapiens (Human)
Description:P43088
Residue:359
BDBM50150903
NameBDBM50150903
Synonyms:(Z)-7-[(2R,3S,4R)-4-Hydroxy-2-((E)-(S)-3-hydroxy-oct-1-enyl)-tetrahydro-furan-3-yl]-hept-5-enoic acid | CHEMBL360869
TypeSmall organic molecule
Emp. Form.C19H32O5
Mol. Mass.340.4544
SMILESCCCCC[C@H](O)\C=C\[C@H]1OC[C@H](O)[C@@H]1C\C=C/CCCC(O)=O