Reaction Details
TargetProstaglandin F2-alpha receptor
LigandBDBM50150900
Substrate/Competitorn/a
Meas. Tech.ChEMBL_310565 (CHEMBL834139)
EC50 58±n/a nM
Citation Selliah, RDHellberg, MRSharif, NAMcLaughlin, MAWilliams, GWScott, DAEarnest, DHaggard, KSDean, WDDelgado, PGaines, MSConrow, REKlimko, PG AL-12182, a novel 11-oxa prostaglandin analog with topical ocular hypotensive activity in the monkey. Bioorg Med Chem Lett14:4525-8 (2004) 
 
Prostaglandin F2-alpha receptor
Name:Prostaglandin F2-alpha receptor
Type:Enzyme
Mol. Mass.:40072.29
Organism:Homo sapiens (Human)
Description:P43088
Residue:359
BDBM50150900
NameBDBM50150900
Synonyms:(Z)-8-{(2R,3S,4R)-2-[(E)-(R)-4-(3-Chloro-phenoxy)-3-hydroxy-but-1-enyl]-4-hydroxy-tetrahydro-furan-3-yl}-oct-6-enoic acid | CHEMBL360862
TypeSmall organic molecule
Emp. Form.C22H29ClO6
Mol. Mass.424.915
SMILESO[C@@H](COc1cccc(Cl)c1)\C=C\[C@H]1OC[C@H](O)[C@@H]1C\C=C/CCCCC(O)=O