Reaction Details
TargetPotassium voltage-gated channel subfamily H member 2
LigandBDBM50370415
Substrate/Competitorn/a
Meas. Tech.ChEMBL_304914 (CHEMBL827807)
IC50 16000±n/a nM
Citation Du, LPTsai, KCLi, MYYou, QDXia, L The pharmacophore hypotheses of I(Kr) potassium channel blockers: novel class III antiarrhythmic agents. Bioorg Med Chem Lett14:4771-7 (2004) 
 
Potassium voltage-gated channel subfamily H member 2
Name:Potassium voltage-gated channel subfamily H member 2
Type:Multi-pass membrane protein
Mol. Mass.:126672.65
Organism:Homo sapiens (Human)
Description:Q12809
Residue:1159
BDBM50370415
NameBDBM50370415
Synonyms:DAURICINE
TypeSmall organic molecule
Emp. Form.C38H44N2O6
Mol. Mass.624.7658
SMILESCOc1cc2CCN(C)[C@H](Cc3ccc(Oc4cc(C[C@H]5N(C)CCc6cc(OC)c(OC)cc56)ccc4O)cc3)c2cc1OC