Reaction Details
TargetPotassium voltage-gated channel subfamily H member 2
LigandBDBM50151853
Substrate/Competitorn/a
Meas. Tech.ChEMBL_304914 (CHEMBL827807)
IC50 10±n/a nM
Citation Du, LPTsai, KCLi, MYYou, QDXia, L The pharmacophore hypotheses of I(Kr) potassium channel blockers: novel class III antiarrhythmic agents. Bioorg Med Chem Lett14:4771-7 (2004) 
 
Potassium voltage-gated channel subfamily H member 2
Name:Potassium voltage-gated channel subfamily H member 2
Type:Multi-pass membrane protein
Mol. Mass.:126672.65
Organism:Homo sapiens (Human)
Description:Q12809
Residue:1159
BDBM50151853
NameBDBM50151853
Synonyms:CHEMBL182977 LY-97241
TypeSmall organic molecule
Emp. Form.C19H32N2O2
Mol. Mass.320.4696
SMILESCCCCCCCN(CC)CCCCc1ccc(cc1)[N+]([O-])=O