Reaction Details
TargetPotassium voltage-gated channel subfamily H member 2
LigandBDBM50131432
Substrate/Competitorn/a
Meas. Tech.ChEMBL_304914 (CHEMBL827807)
IC50 20±n/a nM
Citation Du, LPTsai, KCLi, MYYou, QDXia, L The pharmacophore hypotheses of I(Kr) potassium channel blockers: novel class III antiarrhythmic agents. Bioorg Med Chem Lett14:4771-7 (2004) 
 
Potassium voltage-gated channel subfamily H member 2
Name:Potassium voltage-gated channel subfamily H member 2
Type:Multi-pass membrane protein
Mol. Mass.:126672.65
Organism:Homo sapiens (Human)
Description:Q12809
Residue:1159
BDBM50131432
NameBDBM50131432
Synonyms:CHEMBL533 IBUTILIDE N-{4-[4-(Ethyl-heptyl-amino)-1-hydroxy-butyl]-phenyl}-methanesulfonamide
TypeSmall organic molecule
Emp. Form.C20H36N2O3S
Mol. Mass.384.576
SMILESCCCCCCCN(CC)CCCC(O)c1ccc(NS(C)(=O)=O)cc1