Reaction Details
TargetReverse transcriptase/RNaseH
LigandBDBM50152189
Substrate/Competitorn/a
Meas. Tech.ChEMBL_306520 (CHEMBL827271)
IC50>1000000±n/a nM
Citation Chi, GNeamati, NNair, V Inhibition of the strand transfer step of HIV-1 integrase by non-natural dinucleotides. Bioorg Med Chem Lett14:4815-7 (2004) 
 
Reverse transcriptase/RNaseH
Name:Reverse transcriptase/RNaseH
Type:PROTEIN
Mol. Mass.:65229.15
Organism:Human immunodeficiency virus 1
Description:ChEMBL_1473730
Residue:566
BDBM50152189
NameBDBM50152189
Synonyms:Phosphoric acid 5-(6-amino-purin-9-yl)-2-phosphonooxymethyl-tetrahydro-furan-3-yl ester 4-(6-amino-purin-9-yl)-tetrahydro-furan-2-ylmethyl ester | [4-(4-amino-2-oxo-1,2-dihydropyrimidin-1-yl)-3-hydroxyoxolan-2-yl]methyl [5-(6-amino-9H-purin-9-yl)-2-[(phosphonatooxy)methyl]oxolan-3-yl] phosphate
TypeSmall organic molecule
Emp. Form.C19H23N8O12P2
Mol. Mass.617.3815
SMILESNc1ccn(C2COC(COP([O-])(=O)OC3CC(OC3COP([O-])([O-])=O)n3cnc4c(N)ncnc34)C2O)c(=O)n1