Reaction Details
TargetReverse transcriptase/RNaseH
LigandBDBM50152191
Substrate/Competitorn/a
Meas. Tech.ChEMBL_306454 (CHEMBL829531)
IC50 25000±n/a nM
Citation Chi, GNeamati, NNair, V Inhibition of the strand transfer step of HIV-1 integrase by non-natural dinucleotides. Bioorg Med Chem Lett14:4815-7 (2004) 
 
Reverse transcriptase/RNaseH
Name:Reverse transcriptase/RNaseH
Type:PROTEIN
Mol. Mass.:65229.15
Organism:Human immunodeficiency virus 1
Description:ChEMBL_1473730
Residue:566
BDBM50152191
NameBDBM50152191
Synonyms:Phosphoric acid 5-(4-amino-2-oxo-2H-pyrimidin-1-yl)-3-hydroxy-tetrahydro-furan-2-ylmethyl ester 5-(6-amino-purin-9-yl)-2-phosphonooxymethyl-tetrahydro-furan-3-yl ester | Phosphorylated dinucleotide derivative
TypeSmall organic molecule
Emp. Form.C19H23N8O12P2
Mol. Mass.617.3815
SMILESNc1ccn(C2CC(O)C(COP([O-])(=O)OC3CC(OC3COP([O-])([O-])=O)n3cnc4c(N)ncnc34)O2)c(=O)n1