Reaction Details
TargetBeta-secretase 1
LigandBDBM50128042
Substrate/Competitorn/a
Meas. Tech.ChEMBL_302490 (CHEMBL827180)
Ki 9.4±n/a nM
Citation Rajamani, RReynolds, CH Modeling the binding affinities of beta-secretase inhibitors: application to subsite specificity. Bioorg Med Chem Lett14:4843-6 (2004) 
 
Beta-secretase 1
Name:Beta-secretase 1
Type:Protein
Mol. Mass.:55755.10
Organism:Homo sapiens (Human)
Description:P56817
Residue:501
BDBM50128042
NameBDBM50128042
Synonyms:((S)-1-{1-[(S)-4-(1-Benzylcarbamoyl-2-methyl-propylcarbamoyl)-2-hydroxy-1-isobutyl-pentylcarbamoyl]-2-methanesulfonyl-ethylcarbamoyl}-2-methyl-propyl)-carbamic acid tert-butyl ester CHEMBL294274
TypeSmall organic molecule
Emp. Form.C36H61N5O9S
Mol. Mass.739.963
SMILESCC(C)C[C@H](NC(=O)C(CS(C)(=O)=O)NC(=O)[C@@H](NC(=O)OC(C)(C)C)C(C)C)C(O)CC(C)C(=O)NC(C(C)C)C(=O)NCc1ccccc1