Reaction Details
TargetSphingosine 1-phosphate receptor 1
LigandBDBM50152337
Substrate/Competitorn/a
Meas. Tech.ChEMBL_306053 (CHEMBL833009)
IC50 0.28±n/a nM
Citation Yan, LHale, JJLynch, CLBudhu, RGentry, AMills, SGHajdu, RKeohane, CARosenbach, MJMilligan, JAShei, GJChrebet, GBergstrom, JCard, DRosen, HMandala, SM Design and synthesis of conformationally constrained 3-(N-alkylamino)propylphosphonic acids as potent agonists of sphingosine-1-phosphate (S1P) receptors. Bioorg Med Chem Lett14:4861-6 (2004) 
 
Sphingosine 1-phosphate receptor 1
Name:Sphingosine 1-phosphate receptor 1
Type:Enzyme
Mol. Mass.:42836.02
Organism:Homo sapiens (Human)
Description:P21453
Residue:382
BDBM50152337
NameBDBM50152337
Synonyms:2-amino-2-({[dihydroxy(oxido)--phosphanyl]oxy}methyl)-4-(4-octylphenyl)butan-1-ol | 3-(N-alkylamino) propylphosphonic acid derivative
TypeSmall organic molecule
Emp. Form.C19H35NO5P
Mol. Mass.388.4592
SMILESCCCCCCCCc1ccc(CCC(N)(CO)COP(O)(O)[O-])cc1