Reaction Details
TargetSphingosine 1-phosphate receptor 2
LigandBDBM50152334
Substrate/Competitorn/a
Meas. Tech.ChEMBL_306054 (CHEMBL833010)
IC50>1000±n/a nM
Citation Yan, LHale, JJLynch, CLBudhu, RGentry, AMills, SGHajdu, RKeohane, CARosenbach, MJMilligan, JAShei, GJChrebet, GBergstrom, JCard, DRosen, HMandala, SM Design and synthesis of conformationally constrained 3-(N-alkylamino)propylphosphonic acids as potent agonists of sphingosine-1-phosphate (S1P) receptors. Bioorg Med Chem Lett14:4861-6 (2004) 
 
Sphingosine 1-phosphate receptor 2
Name:Sphingosine 1-phosphate receptor 2
Type:G Protein-Coupled Receptor (GPCR)
Mol. Mass.:38883.16
Organism:Homo sapiens (Human)
Description:Membranes isolated from S1P2-transfected CHO cells were used in ligand binding assay.
Residue:353
BDBM50152334
NameBDBM50152334
Synonyms:(4-Hydroxy-2-tetradecyl-piperidin-4-yl)-methyl-phosphinic acid | CHEMBL183688
TypeSmall organic molecule
Emp. Form.C20H42NO3P
Mol. Mass.375.5261
1CC(O)(CCN1)P(C)(O)=O