Reaction Details
TargetSphingosine 1-phosphate receptor 5
LigandBDBM50152323
Substrate/Competitorn/a
Meas. Tech.ChEMBL_306057 (CHEMBL833013)
IC50 15±n/a nM
Citation Yan, LHale, JJLynch, CLBudhu, RGentry, AMills, SGHajdu, RKeohane, CARosenbach, MJMilligan, JAShei, GJChrebet, GBergstrom, JCard, DRosen, HMandala, SM Design and synthesis of conformationally constrained 3-(N-alkylamino)propylphosphonic acids as potent agonists of sphingosine-1-phosphate (S1P) receptors. Bioorg Med Chem Lett14:4861-6 (2004) 
 
Sphingosine 1-phosphate receptor 5
Name:Sphingosine 1-phosphate receptor 5
Type:G Protein-Coupled Receptor (GPCR)
Mol. Mass.:41796.42
Organism:Homo sapiens (Human)
Description:n/a
Residue:398
BDBM50152323
NameBDBM50152323
Synonyms:CHEMBL187692 | Methyl-[2-(6-tridecyl-piperidin-2-yl)-ethyl]-phosphinic acid
TypeSmall organic molecule
Emp. Form.C21H44NO2P
Mol. Mass.373.5533
1CCCC(CCP(C)(O)=O)N1