Reaction Details
TargetSphingosine 1-phosphate receptor 5
LigandBDBM50152333
Substrate/Competitorn/a
Meas. Tech.ChEMBL_306057 (CHEMBL833013)
IC50 17±n/a nM
Citation Yan, LHale, JJLynch, CLBudhu, RGentry, AMills, SGHajdu, RKeohane, CARosenbach, MJMilligan, JAShei, GJChrebet, GBergstrom, JCard, DRosen, HMandala, SM Design and synthesis of conformationally constrained 3-(N-alkylamino)propylphosphonic acids as potent agonists of sphingosine-1-phosphate (S1P) receptors. Bioorg Med Chem Lett14:4861-6 (2004) 
 
Sphingosine 1-phosphate receptor 5
Name:Sphingosine 1-phosphate receptor 5
Type:G Protein-Coupled Receptor (GPCR)
Mol. Mass.:41796.42
Organism:Homo sapiens (Human)
Description:n/a
Residue:398
BDBM50152333
NameBDBM50152333
Synonyms:CHEMBL187588 | [2-((2R,5S)-5-Tetradecyl-pyrrolidin-2-yl)-ethyl]-phosphonic acid
TypeSmall organic molecule
Emp. Form.C20H42NO3P
Mol. Mass.375.5261
[C@H]1CC[C@H](CCP(O)(O)=O)N1