Reaction Details
TargetSphingosine 1-phosphate receptor 2
LigandBDBM50152327
Substrate/Competitorn/a
Meas. Tech.ChEMBL_306054 (CHEMBL833010)
IC50>1000±n/a nM
Citation Yan, LHale, JJLynch, CLBudhu, RGentry, AMills, SGHajdu, RKeohane, CARosenbach, MJMilligan, JAShei, GJChrebet, GBergstrom, JCard, DRosen, HMandala, SM Design and synthesis of conformationally constrained 3-(N-alkylamino)propylphosphonic acids as potent agonists of sphingosine-1-phosphate (S1P) receptors. Bioorg Med Chem Lett14:4861-6 (2004) 
 
Sphingosine 1-phosphate receptor 2
Name:Sphingosine 1-phosphate receptor 2
Type:G Protein-Coupled Receptor (GPCR)
Mol. Mass.:38883.16
Organism:Homo sapiens (Human)
Description:Membranes isolated from S1P2-transfected CHO cells were used in ligand binding assay.
Residue:353
BDBM50152327
NameBDBM50152327
Synonyms:(3-Hydroxy-1-tetradecyl-pyrrolidin-3-yl)-phosphonic acid | CHEMBL184237
TypeSmall organic molecule
Emp. Form.C18H38NO4P
Mol. Mass.363.4724
1CCC(O)(C1)P(O)(O)=O