Reaction Details
TargetSphingosine 1-phosphate receptor 4
LigandBDBM50152329
Substrate/Competitorn/a
Meas. Tech.ChEMBL_306056 (CHEMBL833012)
IC50 86±n/a nM
Citation Yan, LHale, JJLynch, CLBudhu, RGentry, AMills, SGHajdu, RKeohane, CARosenbach, MJMilligan, JAShei, GJChrebet, GBergstrom, JCard, DRosen, HMandala, SM Design and synthesis of conformationally constrained 3-(N-alkylamino)propylphosphonic acids as potent agonists of sphingosine-1-phosphate (S1P) receptors. Bioorg Med Chem Lett14:4861-6 (2004) 
 
Sphingosine 1-phosphate receptor 4
Name:Sphingosine 1-phosphate receptor 4
Type:G Protein-Coupled Receptor (GPCR)
Mol. Mass.:41647.39
Organism:Homo sapiens (Human)
Description:n/a
Residue:384
BDBM50152329
NameBDBM50152329
Synonyms:1-(4-nonylbenzyl)pyrrolidin-3-ylphosphonic acid [1-(4-Nonyl-benzyl)-pyrrolidin-3-yl]-phosphonic acid
TypeSmall organic molecule
Emp. Form.C20H34NO3P
Mol. Mass.367.4626
SMILESCCCCCCCCCc1ccc(CN2CCC(C2)P(O)(O)=O)cc1