Reaction Details
TargetSphingosine 1-phosphate receptor 4
LigandBDBM50152536
Substrate/Competitorn/a
Meas. Tech.ChEMBL_304397 (CHEMBL830047)
EC50 1600±n/a nM
Citation Clemens, JJDavis, MDLynch, KRMacdonald, TL Synthesis of benzimidazole based analogues of sphingosine-1-phosphate: discovery of potent, subtype-selective S1P4 receptor agonists. Bioorg Med Chem Lett14:4903-6 (2004) 
 
Sphingosine 1-phosphate receptor 4
Name:Sphingosine 1-phosphate receptor 4
Type:G Protein-Coupled Receptor (GPCR)
Mol. Mass.:41647.39
Organism:Homo sapiens (Human)
Description:n/a
Residue:384
BDBM50152536
NameBDBM50152536
Synonyms:(S)-2-Amino-2-(6-octyl-1H-benzoimidazol-2-yl)-ethanol; TFA | CHEMBL186815
TypeSmall organic molecule
Emp. Form.C17H27N3O
Mol. Mass.289.4158
SMILESCCCCCCCCc1ccc2nc([nH]c2c1)[C@H](N)CO