Reaction Details
TargetSphingosine 1-phosphate receptor 4
LigandBDBM50152539
Substrate/Competitorn/a
Meas. Tech.ChEMBL_304397 (CHEMBL830047)
EC50 94±n/a nM
Citation Clemens, JJDavis, MDLynch, KRMacdonald, TL Synthesis of benzimidazole based analogues of sphingosine-1-phosphate: discovery of potent, subtype-selective S1P4 receptor agonists. Bioorg Med Chem Lett14:4903-6 (2004) 
 
Sphingosine 1-phosphate receptor 4
Name:Sphingosine 1-phosphate receptor 4
Type:G Protein-Coupled Receptor (GPCR)
Mol. Mass.:41647.39
Organism:Homo sapiens (Human)
Description:n/a
Residue:384
BDBM50152539
NameBDBM50152539
Synonyms:CHEMBL183894 | Phosphoric acid mono-[(1R,2R)-2-amino-1-methyl-2-(6-octyl-1H-benzoimidazol-2-yl)-ethyl] ester; TFA
TypeSmall organic molecule
Emp. Form.C18H30N3O4P
Mol. Mass.383.4223
SMILESCCCCCCCCc1ccc2nc([nH]c2c1)[C@@H](N)[C@@H](C)OP(O)(O)=O