Reaction Details
TargetSphingosine 1-phosphate receptor 4
LigandBDBM50152538
Substrate/Competitorn/a
Meas. Tech.ChEMBL_304397 (CHEMBL830047)
EC50 48±n/a nM
Citation Clemens, JJDavis, MDLynch, KRMacdonald, TL Synthesis of benzimidazole based analogues of sphingosine-1-phosphate: discovery of potent, subtype-selective S1P4 receptor agonists. Bioorg Med Chem Lett14:4903-6 (2004) 
 
Sphingosine 1-phosphate receptor 4
Name:Sphingosine 1-phosphate receptor 4
Type:G Protein-Coupled Receptor (GPCR)
Mol. Mass.:41647.39
Organism:Homo sapiens (Human)
Description:n/a
Residue:384
BDBM50152538
NameBDBM50152538
Synonyms:CHEMBL185491 | Phosphoric acid mono-[(R)-2-amino-2-(6-octyl-1H-benzoimidazol-2-yl)-ethyl] ester; TFA methyl ester
TypeSmall organic molecule
Emp. Form.C17H28N3O4P
Mol. Mass.369.3957
SMILESCCCCCCCCc1ccc2nc([nH]c2c1)[C@@H](N)COP(O)(O)=O