Reaction Details
TargetDelta-type opioid receptor
LigandBDBM50153124
Substrate/Competitorn/a
Meas. Tech.ChEMBL_303251 (CHEMBL826377)
Ki>2000±n/a nM
Citation Goehring, RRWhitehead, JFBrown, KIslam, KWen, XZhou, XChen, ZValenzano, KJMiller, WSShan, SKyle, DJ 1,3-Dihydro-2,1,3-benzothiadiazol-2,2-diones and 3,4-dihydro-1H-2,1,3-benzothidiazin-2,2-diones as ligands for the NOP receptor. Bioorg Med Chem Lett14:5045-50 (2004) 
 
Delta-type opioid receptor
Name:Delta-type opioid receptor
Type:G Protein-Coupled Receptor (GPCR)
Mol. Mass.:40382.98
Organism:Homo sapiens (Human)
Description:Competition binding assays were carried out using membrane preparations from transfected HN9.10 cells that constitutively expressed the delta opioid receptor.
Residue:372
BDBM50153124
NameBDBM50153124
Synonyms:CHEMBL182967 | N-(2-{1-[1-(4-Isopropyl-cyclohexyl)-piperidin-4-yl]-2,2-dioxo-1,4-dihydro-2H-2lambda*6*-benzo[1,2,6]thiadiazin-3-yl}-ethyl)-methanesulfonamide
TypeSmall organic molecule
Emp. Form.C24H40N4O4S2
Mol. Mass.512.729
SMILESCC(C)C1CCC(CC1)N1CCC(CC1)N1c2ccccc2CN(CCNS(C)(=O)=O)S1(=O)=O