Reaction Details
TargetDelta-type opioid receptor
LigandBDBM21015
Substrate/Competitorn/a
Meas. Tech.ChEMBL_303251 (CHEMBL826377)
Ki>2000±n/a nM
Citation Goehring, RRWhitehead, JFBrown, KIslam, KWen, XZhou, XChen, ZValenzano, KJMiller, WSShan, SKyle, DJ 1,3-Dihydro-2,1,3-benzothiadiazol-2,2-diones and 3,4-dihydro-1H-2,1,3-benzothidiazin-2,2-diones as ligands for the NOP receptor. Bioorg Med Chem Lett14:5045-50 (2004) 
 
Delta-type opioid receptor
Name:Delta-type opioid receptor
Type:G Protein-Coupled Receptor (GPCR)
Mol. Mass.:40382.98
Organism:Homo sapiens (Human)
Description:Competition binding assays were carried out using membrane preparations from transfected HN9.10 cells that constitutively expressed the delta opioid receptor.
Residue:372
BDBM21015
NameBDBM21015
Synonyms:(2S)-2-{2-[(2R)-2-[(2S)-2-amino-3-(4-hydroxyphenyl)propanamido]propanamido]-N-methylacetamido}-N-(2-hydroxyethyl)-3-phenylpropanamide CHEMBL38874 DAMGO US11492374, ID 2 [tyrosyl-3,5-3H(N)]-D-Ala2-Mephe4-glyol5-enkephalin
TypeAnalgesics
Emp. Form.C26H35N5O6
Mol. Mass.513.586
SMILESC[C@@H](NC(=O)[C@@H](N)Cc1ccc(O)cc1)C(=O)NCC(=O)N(C)[C@@H](Cc1ccccc1)C(=O)NCCO