Reaction Details
TargetDelta-type opioid receptor
LigandBDBM50153147
Substrate/Competitorn/a
Meas. Tech.ChEMBL_303251 (CHEMBL826377)
Ki>2000±n/a nM
Citation Goehring, RRWhitehead, JFBrown, KIslam, KWen, XZhou, XChen, ZValenzano, KJMiller, WSShan, SKyle, DJ 1,3-Dihydro-2,1,3-benzothiadiazol-2,2-diones and 3,4-dihydro-1H-2,1,3-benzothidiazin-2,2-diones as ligands for the NOP receptor. Bioorg Med Chem Lett14:5045-50 (2004) 
 
Delta-type opioid receptor
Name:Delta-type opioid receptor
Type:G Protein-Coupled Receptor (GPCR)
Mol. Mass.:40382.98
Organism:Homo sapiens (Human)
Description:Competition binding assays were carried out using membrane preparations from transfected HN9.10 cells that constitutively expressed the delta opioid receptor.
Residue:372
BDBM50153147
NameBDBM50153147
Synonyms:1-[1-(3,3-Diphenyl-propyl)-piperidin-4-yl]-1,3-dihydro-benzo[1,2,5]thiadiazole 2,2-dioxide | CHEMBL187183
TypeSmall organic molecule
Emp. Form.C26H29N3O2S
Mol. Mass.447.592
SMILESO=S1(=O)Nc2ccccc2N1C1CCN(CCC(c2ccccc2)c2ccccc2)CC1