Reaction Details
TargetKappa-type opioid receptor
LigandBDBM50153135
Substrate/Competitorn/a
Meas. Tech.ChEMBL_303168 (CHEMBL829979)
Ki>2000±n/a nM
Citation Goehring, RRWhitehead, JFBrown, KIslam, KWen, XZhou, XChen, ZValenzano, KJMiller, WSShan, SKyle, DJ 1,3-Dihydro-2,1,3-benzothiadiazol-2,2-diones and 3,4-dihydro-1H-2,1,3-benzothidiazin-2,2-diones as ligands for the NOP receptor. Bioorg Med Chem Lett14:5045-50 (2004) 
 
Kappa-type opioid receptor
Name:Kappa-type opioid receptor
Type:G Protein-Coupled Receptor (GPCR)
Mol. Mass.:42648.76
Organism:Homo sapiens (Human)
Description:P41145
Residue:380
BDBM50153135
NameBDBM50153135
Synonyms:1-[1-(3,3-Diphenyl-propyl)-piperidin-4-yl]-3,4-dihydro-1H-benzo[1,2,6]thiadiazine 2,2-dioxide | CHEMBL362160
TypeSmall organic molecule
Emp. Form.C27H31N3O2S
Mol. Mass.461.619
SMILESO=S1(=O)NCc2ccccc2N1C1CCN(CCC(c2ccccc2)c2ccccc2)CC1