Reaction Details
TargetMu-type opioid receptor
LigandBDBM50153134
Substrate/Competitorn/a
Meas. Tech.ChEMBL_303169 (CHEMBL829980)
Ki 188±n/a nM
Citation Goehring, RRWhitehead, JFBrown, KIslam, KWen, XZhou, XChen, ZValenzano, KJMiller, WSShan, SKyle, DJ 1,3-Dihydro-2,1,3-benzothiadiazol-2,2-diones and 3,4-dihydro-1H-2,1,3-benzothidiazin-2,2-diones as ligands for the NOP receptor. Bioorg Med Chem Lett14:5045-50 (2004) 
 
Mu-type opioid receptor
Name:Mu-type opioid receptor
Type:G Protein-Coupled Receptor (GPCR)
Mol. Mass.:44789.51
Organism:Homo sapiens (Human)
Description:P35372
Residue:400
BDBM50153134
NameBDBM50153134
Synonyms:1-[1-(4-Propyl-cyclohexyl)-piperidin-4-yl]-3,4-dihydro-1H-benzo[1,2,6]thiadiazine 2,2-dioxide | CHEMBL184260
TypeSmall organic molecule
Emp. Form.C21H33N3O2S
Mol. Mass.391.571
SMILESCCCC1CCC(CC1)N1CCC(CC1)N1c2ccccc2CNS1(=O)=O