Reaction Details
TargetNociceptin receptor
LigandBDBM50153142
Substrate/Competitorn/a
Meas. Tech.ChEMBL_310609 (CHEMBL837187)
Ki>10000±n/a nM
Citation Goehring, RRWhitehead, JFBrown, KIslam, KWen, XZhou, XChen, ZValenzano, KJMiller, WSShan, SKyle, DJ 1,3-Dihydro-2,1,3-benzothiadiazol-2,2-diones and 3,4-dihydro-1H-2,1,3-benzothidiazin-2,2-diones as ligands for the NOP receptor. Bioorg Med Chem Lett14:5045-50 (2004) 
 
Nociceptin receptor
Name:Nociceptin receptor
Type:G Protein-Coupled Receptor (GPCR)
Mol. Mass.:40702.87
Organism:Homo sapiens (Human)
Description:P41146
Residue:370
BDBM50153142
NameBDBM50153142
Synonyms:1-(1-Biphenyl-4-ylmethyl-piperidin-4-yl)-1,3-dihydro-benzo[1,2,5]thiadiazole 2,2-dioxide | CHEMBL187743
TypeSmall organic molecule
Emp. Form.C24H25N3O2S
Mol. Mass.419.539
SMILESO=S1(=O)Nc2ccccc2N1C1CCN(Cc2ccc(cc2)-c2ccccc2)CC1