Reaction Details
TargetNociceptin receptor
LigandBDBM50153128
Substrate/Competitorn/a
Meas. Tech.ChEMBL_310609 (CHEMBL837187)
EC50 2009±n/a nM
Citation Goehring, RRWhitehead, JFBrown, KIslam, KWen, XZhou, XChen, ZValenzano, KJMiller, WSShan, SKyle, DJ 1,3-Dihydro-2,1,3-benzothiadiazol-2,2-diones and 3,4-dihydro-1H-2,1,3-benzothidiazin-2,2-diones as ligands for the NOP receptor. Bioorg Med Chem Lett14:5045-50 (2004) 
 
Nociceptin receptor
Name:Nociceptin receptor
Type:G Protein-Coupled Receptor (GPCR)
Mol. Mass.:40702.87
Organism:Homo sapiens (Human)
Description:P41146
Residue:370
BDBM50153128
NameBDBM50153128
Synonyms:1-(1-Cyclooctyl-piperidin-4-yl)-3,4-dihydro-1H-benzo[1,2,6]thiadiazine 2,2-dioxide | CHEMBL184451
TypeSmall organic molecule
Emp. Form.C20H31N3O2S
Mol. Mass.377.544
SMILESO=S1(=O)NCc2ccccc2N1C1CCN(CC1)C1CCCCCCC1