Reaction Details
TargetKappa-type opioid receptor
LigandBDBM50153148
Substrate/Competitorn/a
Meas. Tech.ChEMBL_303168 (CHEMBL829979)
Ki>2000±n/a nM
Citation Goehring, RRWhitehead, JFBrown, KIslam, KWen, XZhou, XChen, ZValenzano, KJMiller, WSShan, SKyle, DJ 1,3-Dihydro-2,1,3-benzothiadiazol-2,2-diones and 3,4-dihydro-1H-2,1,3-benzothidiazin-2,2-diones as ligands for the NOP receptor. Bioorg Med Chem Lett14:5045-50 (2004) 
 
Kappa-type opioid receptor
Name:Kappa-type opioid receptor
Type:G Protein-Coupled Receptor (GPCR)
Mol. Mass.:42648.76
Organism:Homo sapiens (Human)
Description:P41145
Residue:380
BDBM50153148
NameBDBM50153148
Synonyms:1-(1-Naphthalen-2-ylmethyl-piperidin-4-yl)-3,4-dihydro-1H-benzo[1,2,6]thiadiazine 2,2-dioxide | CHEMBL184865
TypeSmall organic molecule
Emp. Form.C23H25N3O2S
Mol. Mass.407.529
SMILESO=S1(=O)NCc2ccccc2N1C1CCN(Cc2ccc3ccccc3c2)CC1